تیرورق
scope note: تیر اصلی که جان آن از ورقه‌های فلزی با ارتفاع نسبتاً زیاد و بال‌های آن معمولاً از ورق یا نیم‌رخ‌های فلزی ساخته شده باشد.
broader: شاه‌تیر
preferred label: plate girder @en
type: Concept

شاه‌تیر
preferred label: girder @en
type: Concept
narrower: تیرورق