ورق مهار
scope note: ورقی فلزی یا چوبی که برای محکم نگه ‌داشتن بافۀ سازه، به تکیه‌گاه بسته یا در آن تعبیه شود.
broader: ورق (اجزای سازه‌ای)
preferred label: anchor plate @en
type: Concept

ورق (اجزای سازه‌ای)
preferred label: plate (structural components) @en
type: Concept
narrower: ورق مهار