ورق کمانی
scope note: ورق فولادی که مختصری انحنا به آن می‌دهند تا مقاومت خَمشی آن افزایش یابد.
broader: ورق (اجزای سازه‌ای)
preferred label: buckle plate @en
type: Concept

ورق (اجزای سازه‌ای)
preferred label: plate (structural components) @en
type: Concept
narrower: ورق کمانی