ورق چین‌دار
scope note: ورق فولادی یا سیمانی الیاف‌دار نسوز (asbesto-cement) که به‌صورت چین‌دار ساخته ‌می‌شود و در پوشش سقف و دیوار ساختمان‌ها به کار می‌رود.
broader: ورق (اجزای سازه‌ای)
preferred label: corrugated plate @en
type: Concept

ورق (اجزای سازه‌ای)
preferred label: plate (structural components) @en
type: Concept
narrower: ورق چین‌دار