تجزیۀ برخط
scope note: سامانۀ تجزیۀ خودکاری که در آن با استفاده از کاوند از منبع نمونه می‌گیرند و سپس نمونه را وارد بخش تجزیه می‌کنند.
broader: تجزیه و تحلیل
preferred label: online analysis @en
type: Concept

تجزیه و تحلیل
preferred label: analysis @en
type: Concept
narrower: تجزیۀ برخط