جرم رایانه‌ای
preferred label: computer crime @en
type: Concept
narrower: جرم جعل‌وتزویر رایانه‌ای

جرم جعل‌وتزویر رایانه‌ای
scope note: هر عملی که برای تغییر داده‌ها یا ورود داده‌هایی به‌منظور کلاهبرداری یا اختلاس در یک سامانۀ الکترونیکی صورت گیرد.
broader: جرم رایانه‌ای
preferred label: computer manipulation crime @en
type: Concept