مخروط خروجی
scope note: بخشی از تونل باد که هوا از آزمونگاه به درون آن جریان می‌یابد.
broader: مخروط
preferred label: exit cone @en
type: Concept

مخروط
preferred label: cone @en
type: Concept
narrower: مخروط خروجی