نگاشتار رایانه‌ای
preferred label: computer graphics @en
type: Concept
related: پویانمایی

پویانمایی
alternative label: انیمیشن
scope note: شیوۀ فیلم‌سازی که در آن به تصاویر معمولاً نقاشی‌شده و اجسام بی‌حرکت تحرک بخشیده شود.
related: تصویر متحرک
related: نگاشتار رایانه‌ای
preferred label: animation @en
type: Concept

تصویر متحرک
preferred label: motion picture @en
type: Concept
related: پویانمایی