بطری اکمن
scope note: استوانه‌ای برای نمونه‌برداری از آب‌های عمیق که صفحات دو سر آن براثر ضربه بسته و آب در آن محبوس می‌شود.
broader: بطری
preferred label: Ekman water bottle @en
type: Concept

بطری
preferred label: bottle @en
type: Concept
narrower: بطری اکمن