حوض هوادهی
scope note: مخزنی که در آن فاضلاب یا مایعی دیگر هوادهی می‌شود.
broader: حوض فاضلاب
preferred label: aeration tank @en
type: Concept

حوض فاضلاب
preferred label: sewage tank @en
type: Concept
narrower: حوض هوادهی