قرارداد از دور
scope note: قراردادی که از راه ارتباطات الکترونیکی منعقد شود.
broader: قرارداد
preferred label: distance contract @en
type: Concept

قرارداد
preferred label: contract @en
type: Concept
narrower: قرارداد از دور