قرارداد
preferred label: contract @en
type: Concept
narrower: قرارداد الکترونیکی

قرارداد الکترونیکی
scope note: قراردادی که محتوای آن همانند محتوای قراردادهای معمول کسب‌وکار است ولی در آن مهر و امضا ازطریق ابزارها و فرایند‌های الکترونیکی صورت می‌گیرد.
broader: قرارداد
preferred label: electronic contract @en
type: Concept