پیمان مقطوع بدون تعدیل
scope note: نوعی پیمان مقطوع که خریدار هیچ‌گونه افزایش هزینه‌ای را نمی‌پذیرد.
broader: قرارداد
preferred label: firm fixed-price contract @en
type: Concept

قرارداد
preferred label: contract @en
type: Concept
narrower: پیمان مقطوع بدون تعدیل