پیمان مقطوع
scope note: نوعی پیمان با قیمت کل ثابت برای یک محدودۀ کاری مشخص، که ممکن است مشوق‌هایی برای دستیابی به اهداف پروژه یا فراتر از آن نیز به همراه داشته باشد.
broader: قرارداد
preferred label: lump sum contract @en
type: Concept

قرارداد
preferred label: contract @en
type: Concept
narrower: پیمان مقطوع