قرارداد
preferred label: contract @en
type: Concept
narrower: پیمان فهرست‌بها

پیمان فهرست‌بها
scope note: پیمانی که براساس آن نحوۀ پرداخت کارهای انجام‌شده فهرستی از بهای واحد اقلام است.
broader: قرارداد
preferred label: unit rate contract @en
type: Concept