computing with words
scope note: روشی برای استدلال و رایانش و تصمیم‌گیری براساس اطلاعات تشریح‌شده در زبان طبیعی
broader: computer application
preferred label: رایانش واژه‌بنیاد @fa
type: Concept

computer application
preferred label: کاربرد رایانه @fa
type: Concept
narrower: computing with words