دیگ بخار
preferred label: boiler @en
type: Concept
related: ترک‌خوردگی تردشی

ترک‌خوردگی تردشی
scope note: نوعی شکست فلز، غالباً از نوع خوردگی بین‌بلوری، که در اتصالات پرچی و پایانۀ لوله‌های دیگ‌های بخار اتفاق می‌افتد.
related: دیگ بخار
broader: خوردگی
preferred label: embrittlement cracking @en
type: Concept

خوردگی
preferred label: corrosion @en
type: Concept
narrower: ترک‌خوردگی تردشی