خوردگی خاکستر داغ
scope note: نوعی خوردگی تسریع‌شده که در دمای بالا و در تماس با گازهای حاصل از احتراق نفت کوره که مقدار وانادیم موجود در آن بالاست، حاصل می‌شود
broader: خوردگی
preferred label: hot ash corrosion @en
type: Concept

خوردگی
preferred label: corrosion @en
type: Concept
narrower: خوردگی خاکستر داغ