خوردگی موضعی
preferred label: localized corrosion @en
type: Concept
narrower: خوردگی میکربی

خوردگی میکربی
scope note: نوعی خوردگی موضعی که به دلیل فعالیت ریزاندامگان‌های موجود در زی‌لایه‌های در تماس با محیط‌های آبی و تشکیل محصولات خورنده به وجود می‌آید.
broader: خوردگی موضعی
preferred label: microbiologically influenced corrosion @en
type: Concept