خوردگی نایکنواخت
scope note: نوعی خوردگی موضعی که در نواحی کوچک فلز به وجود می‌آید.
broader: خوردگی موضعی
preferred label: nonuniform corrosion @en
type: Concept

خوردگی موضعی
preferred label: localized corrosion @en
type: Concept
narrower: خوردگی نایکنواخت