داده روشن
preferred label: clear data @en
type: Concept
narrower: داده پوشیده

داده پوشیده
alternative label: واپوشیده‌سازی
scope note: داده‌ای روشن که تبدیل به رمز شده باشد و معنای آن برای گیرندۀ غیرمُجاز قابل درک نباشد.
related: محرمانگی داده
broader: داده روشن
preferred label: enciphered data @en
type: Concept

محرمانگی داده
preferred label: data confidentiality @en
type: Concept
related: داده پوشیده