داده‌های شمارشی
scope note: داده‌های حاصل از شمارش فراوانی وقوع پیشامدهای تصادفی
broader: داده
preferred label: count data @en
type: Concept

داده
preferred label: data @en
type: Concept
narrower: داده‌های شمارشی