یکپارچگی داده‌پیام
preferred label: data message integrity @en
type: Concept
related: داده‌پیام

داده
preferred label: data @en
type: Concept
narrower: داده‌پیام

داده‌پیام
scope note: هرنوع پیام که به شکل داده‌های رقمی با وسایل الکترونیکی یا نوری یا فنّاوری‌های جدید اطلاعات تولید، ارسال، دریافت، ذخیره یا پردازش می‌شود.
related: یکپارچگی داده‌پیام
broader: داده
preferred label: data message @en
type: Concept