داده شطرنجی
scope note: داده‌هایی با ساختار شبکه‌ای خانکی مرکب از شبکه‌های سطری و ستونی
broader: داده
preferred label: raster data @en
type: Concept

داده
preferred label: data @en
type: Concept
narrower: داده شطرنجی