داده
preferred label: data @en
type: Concept
narrower: داده‌های بازنموده

داده‌های بازنموده
scope note: داده‌های ارائه‌شده در قالب‌هایی چون نمودار وجدول و اعداد
related: بازنمود داده‌ها
broader: داده
preferred label: represented data @en
type: Concept

بازنمود داده‌ها
preferred label: data representation @en
type: Concept
related: داده‌های بازنموده