داده
preferred label: data @en
type: Concept
narrower: داده‌های رسانده

داده‌های رسانده
scope note: داده‌هایی که از جایی به جای دیگر منتقل شده باشد.
broader: داده
preferred label: transferred data @en
type: Concept