داده برداری
scope note: نوعی انتزاع از جهان واقعی که در آن موقعیت داده به شکل مختصات بیان می‌شود و واحدهای پایه در آن عبارت‌اند از نقطه و خط و چندضلعی
broader: داده
preferred label: vector data @en
type: Concept

داده
preferred label: data @en
type: Concept
narrower: داده برداری