داده‌بانی
preferred label: data custodianship @en
type: Concept
narrower: گردآوری داده‌ها

گردآوری داده‌ها
scope note: فرایند جمع کردن داده‌های مختلف از منابع متفاوت و پراکنده
broader: داده‌بانی
preferred label: data collection @en
type: Concept