پرونده‌بندی داده‌ها
alternative label: پرونده داده‌ها
scope note: دسته‌بندی اطلاعات و تبدیل آنها به پرونده‌های حاوی داده‌هایی معین در قالب متن یا اعداد یا تصاویر نگاره‌ای
broader: داده‌بانی
preferred label: data filing @en
type: Concept

داده‌بانی
preferred label: data custodianship @en
type: Concept
narrower: پرونده‌بندی داده‌ها