داده‌پردازی
preferred label: data processing @en
type: Concept
narrower: داده‌زایی

داده‌زایی
scope note: فرایندی که در آن، داده‌ها براساس مجموعه‌ای از خصوصیات ازپیش‌تعریف‌شده تولید شوند.
broader: داده‌پردازی
preferred label: data generation @en
type: Concept