گروه‌بندی داده‌ها
scope note: دسته‌بندی مجموعه‌ای از داده‌ها براساس کاربرد و کارکرد آنها
related: داده‌های گروه‌بندی‌شده
broader: داده‌پردازی
preferred label: data grouping @en
type: Concept

داده‌پردازی
preferred label: data processing @en
type: Concept
narrower: گروه‌بندی داده‌ها

داده‌های گروه‌بندی‌شده
preferred label: grouped data @en
type: Concept
related: گروه‌بندی داده‌ها