حفاظت داده‌ها
scope note: محافظت از اطلاعات سامانه در برابر دستیابی غیرمُجاز به داده‌ها و تغییر عمدی یا سهوی آنها به دلیل خطاهای کاربری و خرابی‌های رایانه‌ای
narrower: داده‌بانی پیوسته
broader: داده‌پردازی
preferred label: data protection @en
type: Concept

داده‌پردازی
preferred label: data processing @en
type: Concept
narrower: حفاظت داده‌ها

داده‌بانی پیوسته
preferred label: continuous data protection @en
type: Concept
broader: حفاظت داده‌ها