همتاسازی داده‌ای
alternative label: همتاسازی داده‌ها
scope note: تکثیر داده‌ها بر روی تعدادی از رایانه‌ها در یک سامانۀ توزیعی
broader: داده‌پردازی
preferred label: data replication @en
type: Concept

داده‌پردازی
preferred label: data processing @en
type: Concept
narrower: همتاسازی داده‌ای