دادگان
preferred label: database @en
type: Concept
narrower: کشف دانش در دادگان

کشف دانش در دادگان
alternative label: کشف دانش در پایگاه‌داده
scope note: فرایند شناسایی ساختارهای قابل‌درک و مفید و تازه و معتبر در داده‌ها
broader: دادگان
preferred label: knowledge discovery in databases @en
type: Concept