ترک رویه
scope note: ترکی که در رویۀ جوش یا بر روی تاج مهره‌ها درجهت موازی یا عمود بر راستای جوشکاری به ‌وجود می‌آید.
broader: ترک جوش
preferred label: face crack @en
type: Concept

ترک جوش
preferred label: weld crack @en
type: Concept
narrower: ترک رویه