دررفتگی پیچی
scope note: نوعی ناراستی خطی که در آن مرز میان نواحی لغزیده و نالغزیده در داخل بلور موازی با صفحۀ لغزش است.
broader: دررفتگی (بلور)
preferred label: screw dislocation @en
type: Concept

دررفتگی (بلور)
preferred label: dislocation (crystal) @en
type: Concept
narrower: دررفتگی پیچی