رسوب (نهشته)
preferred label: deposit @en
type: Concept
narrower: رسوب آتش‌سو

رسوب آتش‌سو
alternative label: رسوب سمت آتش
scope note: رسوب بالقوه خورندۀ حاصل از احتراق سوخت‌هایی که سرباره تولید می‌کنند.
broader: رسوب (نهشته)
preferred label: fireside deposit @en
type: Concept