فن پوشانش
preferred label: coating technique @en
type: Concept
narrower: پوشانش غوطه‌ای

پوشانش غوطه‌ای
scope note: قرار دادن مادۀ پوششی بر سطح قطعه با فروبردن آن در ظرف حاوی مادۀ پوششی
broader: فن پوشانش
preferred label: dip coating @en
type: Concept