هوای فشرده
preferred label: compressed air @en
type: Concept
related: افشانش بادی

پوشانش افشانه‌ای
preferred label: spray coating @en
type: Concept
narrower: افشانش بادی

افشانش بادی
scope note: نوعی پوشانش افشانه‌ای که در آن مادۀ پوششی براثر اختلاط با هوای فشرده بسیار ریز می‌شود.
related: هوای فشرده
broader: پوشانش افشانه‌ای
preferred label: air spray @en
type: Concept