طراحی پایین‌به‌بالا
scope note: فرایندی در طراحی سامانۀ رایانه‌ای که از ابتدایی‌ترین و جزئی‌ترین مؤلفه‌ها آغاز می‌شود تا به سطوح بالاتری از مؤلفه‌ها، متشکل از مؤلفه‌های کوچک‌تر، برسد.
related: نرم‌افزار رایانه‌ای
broader: طراحی
preferred label: bottom-up design @en
type: Concept

طراحی
preferred label: design @en
type: Concept
narrower: طراحی پایین‌به‌بالا

نرم‌افزار رایانه‌ای
preferred label: computer software @en
type: Concept
related: طراحی پایین‌به‌بالا