تشخیص آزمایشگاهی
scope note: تشخیص حاصل از بررسی‌های شیمیایی و میکروسکوپی و ایمنی‌شناختی و آسیب‌شناختی خون و ترشحات و بافت‌ها
broader: تشخیص (پزشکی)
preferred label: laboratory diagnosis @en
type: Concept

تشخیص (پزشکی)
preferred label: diagnosis @en
type: Concept
narrower: تشخیص آزمایشگاهی