قرص پراش
alternative label: قرص ایری
scope note: تصویری که عدسی بدون اَبیراهی از چشمۀ نقطه‌ای نور می‌سازد و ناشی از پراش نور از لبه‌های عدسی است.
broader: پراش
preferred label: diffraction disc @en
type: Concept

پراش
preferred label: diffraction @en
type: Concept
narrower: قرص پراش