پاشش چرخش اپتیکی
alternative label: پاشش چرخش نوری
scope note: پاشش حاصل از تغییر چرخش نوری براثر عبور مادۀ فعال نوری، در هنگام تغییر طولِ‌موج
broader: پاشش (موج)
preferred label: optical rotatory dispersion @en
type: Concept

پاشش (موج)
preferred label: dispersion (wave) @en
type: Concept
narrower: پاشش چرخش اپتیکی