زهکشی بسته
alternative label: زهکشی کور
scope note: نوعی زهکشی سطحی که مانند زهکشی یک حوضۀ داخلی به سوی بخش مرکزی است و راهی به اقیانوس ندارد.
broader: زهکشی
preferred label: closed drainage @en
type: Concept

زهکشی
preferred label: drainage @en
type: Concept
narrower: زهکشی بسته