زهکشی سطح سواره‌رو
scope note: ایجاد شیب از محور به سمت هر دو برِ سطح راه به‌منظور تخلیۀ آب‌های سطحی
broader: زهکشی
preferred label: drainage of the carriageway @en
type: Concept

زهکشی
preferred label: drainage @en
type: Concept
narrower: زهکشی سطح سواره‌رو