زهکشی خاک
scope note: روان شدن آب از خاک به‌طور طبیعی یا با قرار دادن لوله‌ها و مجراهای زهکش در درون خاک
broader: زهکشی
preferred label: soil drainage @en
type: Concept

زهکشی
preferred label: drainage @en
type: Concept
narrower: زهکشی خاک