زهکشی زیرسطح
scope note: تخلیۀ آب‌های زیرزمینی برای پایین نگه داشتن سطح آب به ترتیبی که باعث افزایش استحکام لایه‌های زیرین خاک در بستر راه شود.
broader: زهکشی
preferred label: sub-soil drainage @en
type: Concept

زهکشی
preferred label: drainage @en
type: Concept
narrower: زهکشی زیرسطح