کفته
preferred label: jack arch @en
type: Concept
broader: چفته خفته

چفته
preferred label: arch (structural) @en
type: Concept
narrower: چفته خفته

چفته خفته
scope note: چَفته‌ای که افراز‌ آن کمتر از نصف دهانه باشد.
narrower: کفته
broader: چفته
preferred label: depressed arch @en
type: Concept