مغناطیس‌سپهر
preferred label: magnetosphere @en
type: Concept
narrower: جریان حلقوی مغناسپهری

جریان حلقوی مغناسپهری
scope note: جریان جاری در حلقه‌ای از ذرات باردار در پیرامون زمین
broader: مغناطیس‌سپهر
preferred label: magnetospheric ring current @en
type: Concept