زمین‌لرزه
preferred label: earthquake @en
type: Concept
narrower: زمین‌لرزه آتشفشانی

زمین‌لرزه آتشفشانی
scope note: زمین‌لرزه‌ای که با نیروهای آتشفشانی همراه است.
broader: زمین‌لرزه
preferred label: volcanic earthquake @en
type: Concept